{"text_format":"1","workbook":"xlsx","n_sheets":6,"sheets":["checksheet","room","nuclide","one_day_max","one_week_max","three_month_max"],"not_rendered":{"charts":0,"images":0,"macros":1,"external_links":0,"defined_names":4,"comments":0,"pivot_tables":0},"unopened":[],"bounds":{"document_bytes":16777216,"sheet_cells":100000,"rows_first":2000,"rows_last":500,"rows_between":2000,"halvings":0,"cell_chars":16384,"cell_head_chars":4096},"cells_cut":0,"cells_raw":0,"read":"whole","date_system":"1900"}

{"sheet":"checksheet","index":0,"n_rows":105,"n_cols":24,"rows_kept":105,"cut":false,"hidden":false,"merged":[[2,18,2,20],[2,21,2,23],[2,1,2,5],[2,0,3,0],[2,6,2,11],[2,12,2,14],[2,15,2,17]]}
["Usage quantity check sheet"]
[2021,"fiscal year"]
["No.","Input",null,null,null,null,"Automatic calculation",null,null,null,null,null,"Maximum usage quantity (Bq)",null,null,"Cumulative usage quantity (Bq)",null,null,"Usage quantity ratio",null,null,"Simultaneous usage check"]
[null,"Date","Room","Nuclides","Amount","unit","Week\nNo.","Month","Quarter year No.","Room No.","Amount (Bq)","Nuclide group No.","One day","One week","3 month","One day","One week","3mont","One day","One week","3 month","One day","One week","3 month"]
["e.g.","2020-04-18","サイクロトロン室","89Zr",300,"MBq",{"$f":"IF(B5=\"\",\"\",WEEKNUM(B5,1))","v":16},{"$f":"IF(B5=\"\",\"\",MONTH(B5))","v":4},{"$f":"IFERROR(CHOOSE(H5,4,4,4,1,1,1,2,2,2,3,3,3),\"\")","v":1},{"$f":"IFERROR(VLOOKUP(C5,room!$B$3:$C$46,2,FALSE),\"\")","v":"001"},{"$f":"IF(B5=\"\",\"\",IF(F5=\"GBq\",E5*1000000000,IF(F5=\"MBq\",E5*1000000,IF(F5=\"kBq\",E5*1000,E5))))","v":300000000},{"$f":"IFERROR(VLOOKUP(D5,nuclide!$B$3:$C$51,2,FALSE),\"\")","v":4},{"$f":"IFERROR(VLOOKUP(J5,onedaymax1[],L5+1,FALSE),\"\")","v":1300000000},{"$f":"IFERROR(VLOOKUP(J5,oneweekmax[],L5+1,FALSE),\"\")","v":2600000000},{"$f":"IFERROR(VLOOKUP(J5,thremonthmax[],L5+1,FALSE),\"\")","v":33800000000},{"$f":"IF(B5=\"\",\"\",SUMIFS($K$5:$K$200,$B$5:$B$200,\"=\"&B5,$J$5:$J$200,\"=\"&J5,$L$5:$L$200,\"=\"&L5))","v":300000000},{"$f":"IF(B5=\"\",\"\",SUMIFS($K$5:$K$200,$G$5:$G$200,\"=\"&G5,$J$5:$J$200,\"=\"&J5,$L$5:$L$200,\"=\"&L5))","v":300000000},{"$f":"IF(B5=\"\",\"\",SUMIFS($K$5:$K$200,$I$5:$I$200,\"=\"&I5,$J$5:$J$200,\"=\"&J5,$L$5:$L$200,\"=\"&L5))","v":300000000},{"$f":"IFERROR(P5/M5,\"\")","v":0.23076923076923078},{"$f":"IFERROR(Q5/N5,\"\")","v":0.11538461538461539},{"$f":"IFERROR(R5/O5,\"\")","v":8.8757396449704144E-3},{"$f":"IF(OR(J5=\"003\",J5=\"114\"),SUMIFS($S$5:$S$200,$B$5:$B$200,\"=\"&B5,$J$5:$J$200,\"=\"&J5),\"\")","v":""},{"$f":"IF(OR(J5=\"003\",J5=\"114\"),SUMIFS($T$5:$T$200,$G$5:$G$200,\"=\"&G5,$J$5:$J$200,\"=\"&J5),\"\")","v":""},{"$f":"IF(OR(J5=\"003\",J5=\"114\"),SUMIFS($U$5:$U$200,$H$5:$H$200,\"=\"&H5,$J$5:$J$200,\"=\"&J5),\"\")","v":""}]
[1,null,null,null,null,null,{"$f":"IF(B6=\"\",\"\",WEEKNUM(B6,1))","v":""},{"$f":"IF(B6=\"\",\"\",MONTH(B6))","v":""},{"$f":"IFERROR(CHOOSE(H6,4,4,4,1,1,1,2,2,2,3,3,3),\"\")","v":""},{"$f":"IFERROR(VLOOKUP(C6,room!$B$3:$C$46,2,FALSE),\"\")","v":""},{"$f":"IF(B6=\"\",\"\",IF(F6=\"GBq\",E6*1000000000,IF(F6=\"MBq\",E6*1000000,IF(F6=\"kBq\",E6*1000,E6))))","v":""},{"$f":"IFERROR(VLOOKUP(D6,nuclide!$B$3:$C$51,2,FALSE),\"\")","v":""},{"$f":"IFERROR(VLOOKUP(J6,onedaymax1[],L6+1,FALSE),\"\")","v":""},{"$f":"IFERROR(VLOOKUP(J6,oneweekmax[],L6+1,FALSE),\"\")","v":""},{"$f":"IFERROR(VLOOKUP(J6,thremonthmax[],L6+1,FALSE),\"\")","v":""},{"$f":"IF(B6=\"\",\"\",SUMIFS($K$5:$K$200,$B$5:$B$200,\"=\"&B6,$J$5:$J$200,\"=\"&J6,$L$5:$L$200,\"=\"&L6))","v":""},{"$f":"IF(B6=\"\",\"\",SUMIFS($K$5:$K$200,$G$5:$G$200,\"=\"&G6,$J$5:$J$200,\"=\"&J6,$L$5:$L$200,\"=\"&L6))","v":""},{"$f":"IF(B6=\"\",\"\",SUMIFS($K$5:$K$200,$I$5:$I$200,\"=\"&I6,$J$5:$J$200,\"=\"&J6,$L$5:$L$200,\"=\"&L6))","v":""},{"$f":"IFERROR(P6/M6,\"\")","v":""},"","",{"$f":"IF(OR(J6=\"003\",J6=\"114\"),SUMIFS($S$5:$S$200,$B$5:$B$200,\"=\"&B6,$J$5:$J$200,\"=\"&J6),\"\")","v":""},"",""]
[{"$f":"COUNTA($A$6:A6)+1","v":2},null,null,null,null,null,"","","",{"$f":"IFERROR(VLOOKUP(C7,room!$B$3:$C$46,2,FALSE),\"\")","v":""},"",{"$f":"IFERROR(VLOOKUP(D7,nuclide!$B$3:$C$51,2,FALSE),\"\")","v":""},{"$f":"IFERROR(VLOOKUP(J7,onedaymax1[],L7+1,FALSE),\"\")","v":""},{"$f":"IFERROR(VLOOKUP(J7,oneweekmax[],L7+1,FALSE),\"\")","v":""},{"$f":"IFERROR(VLOOKUP(J7,thremonthmax[],L7+1,FALSE),\"\")","v":""},"",{"$f":"IF(B7=\"\",\"\",SUMIFS($K$5:$K$200,$G$5:$G$200,\"=\"&G7,$J$5:$J$200,\"=\"&J7,$L$5:$L$200,\"=\"&L7))","v":""},"","","","","","",""]
[{"$f":"COUNTA($A$6:A7)+1","v":3},null,null,null,null,null,"","","",{"$f":"IFERROR(VLOOKUP(C8,room!$B$3:$C$46,2,FALSE),\"\")","v":""},"",{"$f":"IFERROR(VLOOKUP(D8,nuclide!$B$3:$C$51,2,FALSE),\"\")","v":""},{"$f":"IFERROR(VLOOKUP(J8,onedaymax1[],L8+1,FALSE),\"\")","v":""},{"$f":"IFERROR(VLOOKUP(J8,oneweekmax[],L8+1,FALSE),\"\")","v":""},{"$f":"IFERROR(VLOOKUP(J8,thremonthmax[],L8+1,FALSE),\"\")","v":""},"","","","","","","","",""]
[{"$f":"COUNTA($A$6:A8)+1","v":4},null,null,null,null,null,"","","",{"$f":"IFERROR(VLOOKUP(C9,room!$B$3:$C$46,2,FALSE),\"\")","v":""},"",{"$f":"IFERROR(VLOOKUP(D9,nuclide!$B$3:$C$51,2,FALSE),\"\")","v":""},{"$f":"IFERROR(VLOOKUP(J9,onedaymax1[],L9+1,FALSE),\"\")","v":""},{"$f":"IFERROR(VLOOKUP(J9,oneweekmax[],L9+1,FALSE),\"\")","v":""},{"$f":"IFERROR(VLOOKUP(J9,thremonthmax[],L9+1,FALSE),\"\")","v":""},"","","","","","","","",""]
[{"$f":"COUNTA($A$6:A9)+1","v":5},null,null,null,null,null,"","","",{"$f":"IFERROR(VLOOKUP(C10,room!$B$3:$C$46,2,FALSE),\"\")","v":""},"",{"$f":"IFERROR(VLOOKUP(D10,nuclide!$B$3:$C$51,2,FALSE),\"\")","v":""},{"$f":"IFERROR(VLOOKUP(J10,onedaymax1[],L10+1,FALSE),\"\")","v":""},{"$f":"IFERROR(VLOOKUP(J10,oneweekmax[],L10+1,FALSE),\"\")","v":""},{"$f":"IFERROR(VLOOKUP(J10,thremonthmax[],L10+1,FALSE),\"\")","v":""},"","","","","","","","",""]
[{"$f":"COUNTA($A$6:A10)+1","v":6},null,null,null,null,null,"","","",{"$f":"IFERROR(VLOOKUP(C11,room!$B$3:$C$46,2,FALSE),\"\")","v":""},"",{"$f":"IFERROR(VLOOKUP(D11,nuclide!$B$3:$C$51,2,FALSE),\"\")","v":""},{"$f":"IFERROR(VLOOKUP(J11,onedaymax1[],L11+1,FALSE),\"\")","v":""},{"$f":"IFERROR(VLOOKUP(J11,oneweekmax[],L11+1,FALSE),\"\")","v":""},{"$f":"IFERROR(VLOOKUP(J11,thremonthmax[],L11+1,FALSE),\"\")","v":""},"","","","","","","","",""]
[{"$f":"COUNTA($A$6:A11)+1","v":7},null,null,null,null,null,"","","",{"$f":"IFERROR(VLOOKUP(C12,room!$B$3:$C$46,2,FALSE),\"\")","v":""},"",{"$f":"IFERROR(VLOOKUP(D12,nuclide!$B$3:$C$51,2,FALSE),\"\")","v":""},{"$f":"IFERROR(VLOOKUP(J12,onedaymax1[],L12+1,FALSE),\"\")","v":""},{"$f":"IFERROR(VLOOKUP(J12,oneweekmax[],L12+1,FALSE),\"\")","v":""},{"$f":"IFERROR(VLOOKUP(J12,thremonthmax[],L12+1,FALSE),\"\")","v":""},"","","","","","","","",""]
[{"$f":"COUNTA($A$6:A12)+1","v":8},null,null,null,null,null,"","","",{"$f":"IFERROR(VLOOKUP(C13,room!$B$3:$C$46,2,FALSE),\"\")","v":""},"",{"$f":"IFERROR(VLOOKUP(D13,nuclide!$B$3:$C$51,2,FALSE),\"\")","v":""},{"$f":"IFERROR(VLOOKUP(J13,onedaymax1[],L13+1,FALSE),\"\")","v":""},{"$f":"IFERROR(VLOOKUP(J13,oneweekmax[],L13+1,FALSE),\"\")","v":""},{"$f":"IFERROR(VLOOKUP(J13,thremonthmax[],L13+1,FALSE),\"\")","v":""},"","","","","","","","",""]
[{"$f":"COUNTA($A$6:A13)+1","v":9},null,null,null,null,null,"","","",{"$f":"IFERROR(VLOOKUP(C14,room!$B$3:$C$46,2,FALSE),\"\")","v":""},"",{"$f":"IFERROR(VLOOKUP(D14,nuclide!$B$3:$C$51,2,FALSE),\"\")","v":""},{"$f":"IFERROR(VLOOKUP(J14,onedaymax1[],L14+1,FALSE),\"\")","v":""},{"$f":"IFERROR(VLOOKUP(J14,oneweekmax[],L14+1,FALSE),\"\")","v":""},{"$f":"IFERROR(VLOOKUP(J14,thremonthmax[],L14+1,FALSE),\"\")","v":""},"","","","","","","","",""]
[{"$f":"COUNTA($A$6:A14)+1","v":10},null,null,null,null,null,"","","",{"$f":"IFERROR(VLOOKUP(C15,room!$B$3:$C$46,2,FALSE),\"\")","v":""},"",{"$f":"IFERROR(VLOOKUP(D15,nuclide!$B$3:$C$51,2,FALSE),\"\")","v":""},{"$f":"IFERROR(VLOOKUP(J15,onedaymax1[],L15+1,FALSE),\"\")","v":""},{"$f":"IFERROR(VLOOKUP(J15,oneweekmax[],L15+1,FALSE),\"\")","v":""},{"$f":"IFERROR(VLOOKUP(J15,thremonthmax[],L15+1,FALSE),\"\")","v":""},"","","","","","","","",""]
[{"$f":"COUNTA($A$6:A15)+1","v":11},null,null,null,null,null,"","","",{"$f":"IFERROR(VLOOKUP(C16,room!$B$3:$C$46,2,FALSE),\"\")","v":""},"",{"$f":"IFERROR(VLOOKUP(D16,nuclide!$B$3:$C$51,2,FALSE),\"\")","v":""},{"$f":"IFERROR(VLOOKUP(J16,onedaymax1[],L16+1,FALSE),\"\")","v":""},{"$f":"IFERROR(VLOOKUP(J16,oneweekmax[],L16+1,FALSE),\"\")","v":""},{"$f":"IFERROR(VLOOKUP(J16,thremonthmax[],L16+1,FALSE),\"\")","v":""},"","","","","","","","",""]
[{"$f":"COUNTA($A$6:A16)+1","v":12},null,null,null,null,null,"","","",{"$f":"IFERROR(VLOOKUP(C17,room!$B$3:$C$46,2,FALSE),\"\")","v":""},"",{"$f":"IFERROR(VLOOKUP(D17,nuclide!$B$3:$C$51,2,FALSE),\"\")","v":""},{"$f":"IFERROR(VLOOKUP(J17,onedaymax1[],L17+1,FALSE),\"\")","v":""},{"$f":"IFERROR(VLOOKUP(J17,oneweekmax[],L17+1,FALSE),\"\")","v":""},{"$f":"IFERROR(VLOOKUP(J17,thremonthmax[],L17+1,FALSE),\"\")","v":""},"","","","","","","","",""]
[{"$f":"COUNTA($A$6:A17)+1","v":13},null,null,null,null,null,"","","",{"$f":"IFERROR(VLOOKUP(C18,room!$B$3:$C$46,2,FALSE),\"\")","v":""},"",{"$f":"IFERROR(VLOOKUP(D18,nuclide!$B$3:$C$51,2,FALSE),\"\")","v":""},{"$f":"IFERROR(VLOOKUP(J18,onedaymax1[],L18+1,FALSE),\"\")","v":""},{"$f":"IFERROR(VLOOKUP(J18,oneweekmax[],L18+1,FALSE),\"\")","v":""},{"$f":"IFERROR(VLOOKUP(J18,thremonthmax[],L18+1,FALSE),\"\")","v":""},"","","","","","","","",""]
[{"$f":"COUNTA($A$6:A18)+1","v":14},null,null,null,null,null,"","","",{"$f":"IFERROR(VLOOKUP(C19,room!$B$3:$C$46,2,FALSE),\"\")","v":""},"",{"$f":"IFERROR(VLOOKUP(D19,nuclide!$B$3:$C$51,2,FALSE),\"\")","v":""},{"$f":"IFERROR(VLOOKUP(J19,onedaymax1[],L19+1,FALSE),\"\")","v":""},{"$f":"IFERROR(VLOOKUP(J19,oneweekmax[],L19+1,FALSE),\"\")","v":""},{"$f":"IFERROR(VLOOKUP(J19,thremonthmax[],L19+1,FALSE),\"\")","v":""},"","","","","","","","",""]
[{"$f":"COUNTA($A$6:A19)+1","v":15},null,null,null,null,null,"","","",{"$f":"IFERROR(VLOOKUP(C20,room!$B$3:$C$46,2,FALSE),\"\")","v":""},"",{"$f":"IFERROR(VLOOKUP(D20,nuclide!$B$3:$C$51,2,FALSE),\"\")","v":""},{"$f":"IFERROR(VLOOKUP(J20,onedaymax1[],L20+1,FALSE),\"\")","v":""},{"$f":"IFERROR(VLOOKUP(J20,oneweekmax[],L20+1,FALSE),\"\")","v":""},{"$f":"IFERROR(VLOOKUP(J20,thremonthmax[],L20+1,FALSE),\"\")","v":""},"","","","","","","","",""]
{"$rows_left_out":86}
{"sheet":"room","index":1,"n_rows":46,"n_cols":4,"rows_kept":46,"cut":false,"hidden":false,"merged":[]}
[]
[null,"使用室","場所"]
[null,"サイクロトロン室","001"]
[null,"ホットラボ室セル内","001"]
[null,"ホットラボ室セル外","002"]
[null,"小中動物用PETカメラ室","003"]
[null,"サル乾燥室","004"]
[null,"サル一時飼育室","005"]
[null,"配分室","006",102]
[null,"廃棄物仕分室","101"]
[null,"物理実験室","103"]
[null,"化学実験室","103"]
[null,"分析機器室２","104"]
[null,"暗室１","105"]
[null,"暗室２","105"]
[null,"暗室３","105"]
[null,"分析機器室１","104"]
[null,"細胞病理実験室","007",106]
[null,"動物組織培養室","104"]
[null,"測定後処理室","104"]
{"$rows_left_out":27}
{"sheet":"nuclide","index":2,"n_rows":51,"n_cols":5,"rows_kept":51,"cut":false,"hidden":false,"merged":[]}
[]
[null,"核種一覧","グループ",null,"単位"]
[null,"11C",1,null,"Bq"]
[null,"13N",1,null,"kBq"]
[null,"15O",2,null,"MBq"]
[null,"18F",3,null,"GBq"]
[null,"64Cu",4]
[null,"89Zr",4]
[null,"67Ga",5]
[null,"99mTc",5]
[null,"111In",5]
[null,"201Tl",5]
[null,"123I",6]
[null,"124I",7]
[null,"125I",7]
[null,"131I",7]
[null,"24Na",8]
[null,"54Mn",8]
[null,"55Fe",8]
[null,"57Co",8]
{"$rows_left_out":32}
{"sheet":"one_day_max","index":3,"n_rows":46,"n_cols":15,"rows_kept":46,"cut":false,"hidden":false,"merged":[[0,2,0,14]]}
[null,"場所","グループ"]
["使用室","列1","1","2","3","4","5","6","7","8","9","10","11","12","13"]
["サイクロトロン室","001",114000000000,9600000000,168000000000,1300000000]
["ホットラボ室セル内","001",114000000000,9600000000,168000000000,1300000000]
["ホットラボ室セル外","002",11400000000,null,16000000000,1300000000]
["小中動物用PETカメラ室","003",6000000000,9600000000,2000000000,500000000,370000000,370000000,3700000]
["サル乾燥室","004",370000000,960000000,370000000,50000000,50000000,50000000,40000000]
["サル一時飼育室","005",60000000,900000000,120000000,50000000,40000000,40000000,40000000]
["配分室","006",370000000,null,370000000,300000000,1850000000,370000000,50000000,2000000,1850000000,2000000000,200000000,200000,15000]
["廃棄物仕分室","101",37000000,96000000,37000000,30000000,555000000,77000000,50000000,1200000,555000000,1000000000,100000000,20000,15000]
["物理実験室","103",null,null,null,null,10000000,10000000,10000000,2000000,null,40000000,40000000,200000]
["化学実験室","103",null,null,null,null,10000000,10000000,10000000,2000000,null,40000000,40000000,200000]
["分析機器室２","104",null,null,null,null,10000000,10000000,10000000,2000000,null,40000000,40000000,200000]
["暗室１","105",null,null,null,null,1000000,1000000,1000000,1000000,null,4000000,4000000,20000]
["暗室２","105",null,null,null,null,1000000,1000000,1000000,1000000,null,4000000,4000000,20000]
["暗室３","105",null,null,null,null,1000000,1000000,1000000,1000000,null,4000000,4000000,20000]
["分析機器室１","104",null,null,null,null,10000000,10000000,10000000,2000000,null,40000000,40000000,200000]
["細胞病理実験室","007",370000000,960000000,370000000,80000000,120000000,185000000,20000000,2000000,null,40000000,40000000,200000]
["動物組織培養室","104",null,null,null,null,10000000,10000000,10000000,2000000,null,40000000,40000000,200000]
["測定後処理室","104",null,null,null,null,10000000,10000000,10000000,2000000,null,40000000,40000000,200000]
{"$rows_left_out":27}
{"sheet":"one_week_max","index":4,"n_rows":46,"n_cols":31,"rows_kept":46,"cut":false,"hidden":false,"merged":[]}
[null,"1週最大"]
[null,"使用室","場所","1","2","3","4","5","6","7","8","9","10","11","12","13",null,null,"１日\n最大\n","１日\n最大\n","１日\n最大\n","１日\n最大\n","１日\n最大\n","１日\n最大\n","１日\n最大\n","１日\n最大\n","１日\n最大\n","１日\n最大\n","１日\n最大\n","１日\n最大\n","１日\n最大\n"]
[null,"サイクロトロン室","001",{"$f":"S3*5","v":570000000000},{"$f":"T3*2","v":19200000000},{"$f":"U3*5","v":840000000000},{"$f":"V3*2","v":2600000000},null,null,null,null,null,null,null,null,null,null,null,114000000000,9600000000,168000000000,1300000000]
[null,"ホットラボ室セル内","001",570000000000,{"$f":"T4*2","v":19200000000},840000000000,2600000000,null,null,null,null,null,null,null,null,null,null,null,114000000000,9600000000,168000000000,1300000000]
[null,"ホットラボ室セル外","002",57000000000,null,80000000000,2600000000,null,null,null,null,null,null,null,null,null,null,null,11400000000,null,16000000000,1300000000]
[null,"小中動物用PETカメラ室","003",30000000000,{"$f":"T6*2","v":19200000000},10000000000,1000000000,{"$f":"W6*5","v":1850000000},{"$f":"X6*5","v":1850000000},{"$f":"Y6*5","v":18500000},null,null,null,null,null,null,null,null,6000000000,9600000000,2000000000,500000000,370000000,370000000,3700000]
[null,"サル乾燥室","004",1850000000,{"$f":"T7*2","v":1920000000},1850000000,100000000,250000000,250000000,200000000,null,null,null,null,null,null,null,null,370000000,960000000,370000000,50000000,50000000,50000000,40000000]
[null,"サル一時飼育室","005",300000000,{"$f":"T8*2","v":1800000000},600000000,100000000,200000000,200000000,200000000,null,null,null,null,null,null,null,null,60000000,900000000,120000000,50000000,40000000,40000000,40000000]
[null,"配分室","006",1850000000,null,1850000000,600000000,9250000000,1850000000,250000000,{"$f":"Z9*5","v":10000000},9250000000,10000000000,1000000000,1000000,75000,null,null,370000000,null,370000000,300000000,1850000000,370000000,50000000,2000000,1850000000,2000000000,200000000,200000,15000]
[null,"廃棄物仕分室","101",185000000,{"$f":"T10*2","v":192000000},185000000,60000000,2775000000,385000000,250000000,6000000,2775000000,5000000000,500000000,100000,75000,null,null,37000000,96000000,37000000,30000000,555000000,77000000,50000000,1200000,555000000,1000000000,100000000,20000,15000]
[null,"物理実験室","103",null,null,null,null,50000000,50000000,50000000,{"$f":"Z11*5","v":10000000},null,{"$f":"AB11*5","v":200000000},{"$f":"AC11*5","v":200000000},{"$f":"AD11*5","v":1000000},null,null,null,null,null,null,null,10000000,10000000,10000000,2000000,null,40000000,40000000,200000]
[null,"化学実験室","103",null,null,null,null,50000000,50000000,50000000,10000000,null,200000000,200000000,1000000,null,null,null,null,null,null,null,10000000,10000000,10000000,2000000,null,40000000,40000000,200000]
[null,"分析機器室２","104",null,null,null,null,50000000,50000000,50000000,10000000,null,200000000,200000000,1000000,null,null,null,null,null,null,null,10000000,10000000,10000000,2000000,null,40000000,40000000,200000]
[null,"暗室１","105",null,null,null,null,5000000,5000000,5000000,5000000,null,20000000,20000000,100000,null,null,null,null,null,null,null,1000000,1000000,1000000,1000000,null,4000000,4000000,20000]
[null,"暗室２","105",null,null,null,null,5000000,5000000,5000000,5000000,null,20000000,20000000,100000,null,null,null,null,null,null,null,1000000,1000000,1000000,1000000,null,4000000,4000000,20000]
[null,"暗室３","105",null,null,null,null,5000000,5000000,5000000,5000000,null,20000000,20000000,100000,null,null,null,null,null,null,null,1000000,1000000,1000000,1000000,null,4000000,4000000,20000]
[null,"分析機器室１","104",null,null,null,null,50000000,50000000,50000000,10000000,null,200000000,200000000,1000000,null,null,null,null,null,null,null,10000000,10000000,10000000,2000000,null,40000000,40000000,200000]
[null,"細胞病理実験室","007",{"$f":"S18*5","v":1850000000},{"$f":"T18*2","v":1920000000},{"$f":"U18*5","v":1850000000},{"$f":"V18*2","v":160000000},600000000,925000000,100000000,10000000,null,200000000,200000000,1000000,null,null,null,370000000,960000000,370000000,80000000,120000000,185000000,20000000,2000000,null,40000000,40000000,200000]
[null,"動物組織培養室","104",null,null,null,null,50000000,50000000,50000000,10000000,null,200000000,200000000,1000000,null,null,null,null,null,null,null,10000000,10000000,10000000,2000000,null,40000000,40000000,200000]
[null,"測定後処理室","104",null,null,null,null,50000000,50000000,50000000,10000000,null,200000000,200000000,1000000,null,null,null,null,null,null,null,10000000,10000000,10000000,2000000,null,40000000,40000000,200000]
{"$rows_left_out":27}
{"sheet":"three_month_max","index":5,"n_rows":46,"n_cols":16,"rows_kept":46,"cut":false,"hidden":false,"merged":[]}
[]
[null,"使用室","場所","1","2","3","4","5","6","7","8","9","10","11","12","13"]
[null,"サイクロトロン室","001",6840000000000,240000000000,10080000000000,33800000000]
[null,"ホットラボ室セル内","001",6840000000000,240000000000,10080000000000,33800000000]
[null,"ホットラボ室セル外","002",684000000000,null,960000000000,33800000000]
[null,"小中動物用PETカメラ室","003",234000000000,240000000000,120000000000,13000000000,1850000000,1850000000,37000000]
[null,"サル乾燥室","004",22200000000,24000000000,22200000000,1250000000,1000000000,1000000000,1000000000]
[null,"サル一時飼育室","005",3600000000,22500000000,7200000000,1250000000,800000000,800000000,800000000]
[null,"配分室","006",22200000000,null,22200000000,7500000000,20000000000,2250000000,1500000000,38000000,18500000000,75000000000,2000000000,500000,75000]
[null,"廃棄物仕分室","101",2220000000,2400000000,2220000000,750000000,3950000000,760000000,750000000,1500000,3950000000,7500000000,1000000000,50000,75000]
[null,"物理実験室","103",null,null,null,null,200000000,200000000,200000000,38000000,null,1500000000,1500000000,500000]
[null,"化学実験室","103",null,null,null,null,200000000,200000000,200000000,38000000,null,1500000000,1500000000,500000]
[null,"分析機器室２","104",null,null,null,null,200000000,200000000,200000000,38000000,null,1500000000,1500000000,500000]
[null,"暗室１","105",null,null,null,null,20000000,20000000,20000000,20000000,null,150000000,150000000,50000]
[null,"暗室２","105",null,null,null,null,20000000,20000000,20000000,20000000,null,150000000,150000000,50000]
[null,"暗室３","105",null,null,null,null,20000000,20000000,20000000,20000000,null,150000000,150000000,50000]
[null,"分析機器室１","104",null,null,null,null,200000000,200000000,200000000,38000000,null,1500000000,1500000000,500000]
[null,"細胞病理実験室","007",22200000000,24000000000,22200000000,4800000000,1850000000,1850000000,370000000,38000000,null,1500000000,1500000000,500000]
[null,"動物組織培養室","104",null,null,null,null,200000000,200000000,200000000,38000000,null,1500000000,1500000000,500000]
[null,"測定後処理室","104",null,null,null,null,200000000,200000000,200000000,38000000,null,1500000000,1500000000,500000]
{"$rows_left_out":26}